user2824393
user2824393

Reputation: 649

ubuntu "make" error : hg: not found

I am trying to 'make' a project with ubuntu. I get this error :

sh: 1: hg: not found
make[3]: *** [/home/user/myproject/build/CMakeFiles/stamp/eigen3-download] Error 127
make[2]: *** [CMakeFiles/eigen3.dir/all] Error 2
make[1]: *** [all] Error 2
make: *** [externals] Error 2

What is the problem ?

Thanks

Upvotes: 6

Views: 11452

Answers (1)

P̲̳x͓L̳
P̲̳x͓L̳

Reputation: 3653

You need Mercurial. Install it with

sudo apt-get install mercurial

Upvotes: 13

Related Questions